{"text_format":"1","workbook":"xlsx","n_sheets":18,"sheets":["Building Information","Compliance Paths","Part 3 - Prescriptive","Part 3 -  Details","Part 3 - Trade-off","Part 4 - Prescriptive","Part 4 - Details","Part 4 - Trade-off","Part 5 - Prescriptive","Part 5 - Details","Part 5 - Trade-off","Part 6 - Prescriptive","Part 6 - Details","Part 6 - Trade-off","Part 7 - Prescriptive","Part 8 - Performance","Validation Reference","Code Tables"],"not_rendered":{"charts":0,"images":25,"macros":1,"external_links":0,"defined_names":10,"comments":0,"pivot_tables":0},"unopened":[],"bounds":{"document_bytes":16777216,"sheet_cells":100000,"rows_first":2000,"rows_last":500,"rows_between":2000,"halvings":0,"cell_chars":16384,"cell_head_chars":4096},"cells_cut":0,"cells_raw":0,"read":"whole","date_system":"1900"}

{"sheet":"Building Information","index":0,"n_rows":55,"n_cols":15,"rows_kept":55,"cut":false,"hidden":false,"merged":[[28,0,28,1],[16,0,16,1],[16,2,16,6],[36,3,36,6],[30,3,30,6],[34,3,34,6],[34,0,34,1],[35,0,35,1],[36,0,36,1],[31,0,31,1],[31,3,31,6],[33,3,33,6],[33,0,33,1],[30,0,30,1],[38,0,38,8],[22,2,22,6],[37,0,37,1],[27,0,27,1],[37,3,37,6],[27,3,27,6],[25,0,25,1],[25,3,25,6],[24,0,24,1],[24,3,24,6],[22,0,22,1],[17,7,37,8],[17,0,17,1],[20,0,20,1],[35,3,35,6],[29,0,29,1],[0,0,5,8],[15,0,15,6],[32,0,32,1],[32,3,32,6],[6,0,6,8],[7,0,7,8],[8,0,13,8],[14,0,14,8],[20,2,20,6],[21,0,21,1],[21,2,21,6],[19,0,19,1],[19,2,19,6],[18,0,18,1],[18,2,18,6],[17,2,17,6]]}
["NECB 2017 Compliance Checklist"]
[]
[]
[]
[]
[null,null,null,null,null,null,null,null,null,null,null,null,null,null,"Pre-build Project Summary"]
["About this Document",null,null,null,null,null,null,null,null,null,null,null,null,null,"As-built Project Summary"]
[]
["This form provides information to show compliance with requirements to meet the National Energy Code for Buildings (NECB) 2017. For details please consult NECB 2017 Division B, Appendix A;  A-1.1.2.1.\nThis document is to be used alongside the code document NECB 2017. Any textual interpretation will apply only to the specific language of the code document NECB 2017, to which all users of this compliance spreadsheet are referred.\n\n\n"]
[]
{"$rows_left_out":46}
{"sheet":"Compliance Paths","index":1,"n_rows":32,"n_cols":6,"rows_kept":32,"cut":false,"hidden":false,"merged":[[16,5,16,16383],[21,5,21,8],[0,0,1,8],[26,5,26,8],[31,5,31,8],[27,0,28,8],[29,0,29,4],[29,5,29,8],[2,0,3,8],[4,0,4,4],[9,0,9,4],[14,0,14,4],[11,5,11,8],[6,5,6,8]]}
["NECB 2017 Compliance Paths"]
[]
["Select the compliance path you will use for each Part of the NECB.\nProvide name and email of each contact."]
[]
["Building Envelope (NECB Part 3):"]
[null,null,null,null,null,"Building Envelope Contact"]
[null,null,null,null,null," "]
[]
[]
["Lighting (NECB Part 4):"]
{"$rows_left_out":23}
{"sheet":"Part 3 - Prescriptive","index":2,"n_rows":51,"n_cols":9,"rows_kept":51,"cut":false,"hidden":true,"merged":[[1,8,7,8],[2,1,2,5],[0,0,0,8]]}
["Part 3 - Prescriptive"]
[{"$f":"'Building Information'!A19:B19","v":"Project Name"},{"$f":"'Building Information'!C19","v":0},null,null,null,null,null,null,{"$f":"IF(SUM(G21:G47) = COUNTA(A13:A51),\"NECB 2015 Compliant\", \"\")","v":""}]
[{"$f":"'Building Information'!A18:B18","v":"Date (yyyy-mm-dd)"},{"$f":"'Building Information'!C18","v":"00:00:00"}]
[{"$f":"'Building Information'!A21:B21","v":"Contact Person"},{"$f":"'Building Information'!C21","v":0}]
["Building Envelope Contact",{"$f":"'Compliance Paths'!F7","v":" "}]
["Climate Zone",{"$f":"'Building Information'!C38","v":""}]
[null,{"$f":"IF('Building Information'!C28= \"No\", \"Fully Heated Building\", \"Semi-heated Building\")","v":"Fully Heated Building"}]
["Building Permit Number",{"$f":"'Building Information'!I16","v":" (for internal use only)"}]
[]
["#","Question",null,null,"Requirements","Units",null,"Compliant?","Additional Comments"]
{"$rows_left_out":42}
{"sheet":"Part 3 -  Details","index":3,"n_rows":7,"n_cols":11,"rows_kept":7,"cut":false,"hidden":true,"merged":[[0,0,0,9],[1,0,1,9]]}
["Part 3 - Details"]
["Please complete the following sheet for all envelope assemblies in the building."]
["Assembly #","Assembly Name","Assembly Type\n(Please add unique assembly name)","Design U-Value W/(m2∙K)",null,"Code U-Value W/(m2∙K)","Assembly Separating two Conditioned Spaces","Temperature of Colder Conditioned Space  ºC","Temperature of Warmer Conditioned Space ºC","January Designed Temperature ºC"]
[{"$f":"ROW(A4)-3","v":1},null,null,null,{"$f":"IF(C4=\"\",\"\",VLOOKUP(C4, 'Code Tables'!$B$4:$H$11,VLOOKUP('Building Information'!$C$38,'Validation Reference'!$C$2:$D$7,2),FALSE))","v":""},{"$f":"IF(C4<>\"\",ROUND(IF(G4=\"Yes\", ((I4-J4)/(I4-(0.5*H4)-(0.5*J4)))*E4,E4),3),\"\")","v":""},null,null,null,null,{"$f":"(I4-J4)/((I4-(0.5*H4)-(0.5*J4))*F4)","v":{"$error":"#VALUE!"}}]
[{"$f":"ROW(A5)-3","v":2},null,null,null,{"$f":"IF(C5=\"\",\"\",VLOOKUP(C5, 'Code Tables'!$B$4:$H$11,VLOOKUP('Building Information'!$C$38,'Validation Reference'!$C$2:$D$7,2),FALSE))","v":""},{"$f":"IF(C5<>\"\",ROUND(IF(G5=\"Yes\", ((I5-J5)/(I5-(0.5*H5)-(0.5*J5)))*E5,E5),3),\"\")","v":""},null,null,null,null,{"$f":"(I5-J5)/((I5-(0.5*H5)-(0.5*J5))*F5)","v":{"$error":"#VALUE!"}}]
[3,null,null,null,{"$f":"IF(C6=\"\",\"\",VLOOKUP(C6, 'Code Tables'!$B$4:$H$11,VLOOKUP('Building Information'!$C$38,'Validation Reference'!$C$2:$D$7,2),FALSE))","v":""},{"$f":"IF(C6<>\"\",ROUND(IF(G6=\"Yes\", ((I6-J6)/(I6-(0.5*H6)-(0.5*J6)))*E6,E6),3),\"\")","v":""},null,null,null,null,{"$error":"#VALUE!"}]
[4,null,null,null,{"$f":"IF(C7=\"\",\"\",VLOOKUP(C7, 'Code Tables'!$B$4:$H$11,VLOOKUP('Building Information'!$C$38,'Validation Reference'!$C$2:$D$7,2),FALSE))","v":""},{"$f":"IF(C7<>\"\",ROUND(IF(G7=\"Yes\", ((I7-J7)/(I7-(0.5*H7)-(0.5*J7)))*E7,E7),3),\"\")","v":""},null,null,null,null,{"$error":"#VALUE!"}]

{"sheet":"Part 3 - Trade-off","index":4,"n_rows":47,"n_cols":9,"rows_kept":47,"cut":false,"hidden":true,"merged":[[1,8,6,8],[0,0,0,8],[2,1,2,5]]}
["Part 3 - Trade-off"]
[{"$f":"'Building Information'!A19:B19","v":"Project Name"},{"$f":"'Building Information'!C19","v":0},null,null,null,null,null,null,{"$f":"IF(SUM(G12:G20) = 33,\"NECB 2015 Compliant\", \"\")","v":""}]
[{"$f":"'Building Information'!A18:B18","v":"Date (yyyy-mm-dd)"},{"$f":"'Building Information'!C18","v":"00:00:00"}]
[{"$f":"'Building Information'!A21:B21","v":"Contact Person"},{"$f":"'Building Information'!C21","v":0}]
["Building Envelope Contact",{"$f":"'Compliance Paths'!F7","v":" "}]
["Climate Zone",{"$f":"'Building Information'!C38","v":""}]
[null,{"$f":"IF('Building Information'!C28= \"No\", \"Fully Heated Building\", \"Semi-heated Building\")","v":"Fully Heated Building"}]
["Building Permit Number",{"$f":"'Building Information'!I16","v":" (for internal use only)"}]
[]
["#","Question",null,null,"Requirements","Units",null,"Compliant?","Additional Comments"]
{"$rows_left_out":38}
{"sheet":"Part 4 - Prescriptive","index":5,"n_rows":56,"n_cols":9,"rows_kept":56,"cut":false,"hidden":true,"merged":[[1,8,6,8],[0,0,0,8],[2,1,2,5]]}
["Part 4 - Prescriptive"]
[{"$f":"'Building Information'!A19:B19","v":"Project Name"},{"$f":"'Building Information'!C19","v":"00:00:00"},null,null,null,null,null,null,{"$f":"IF(SUM(G12:G20) = 33,\"NECB 2015 Compliant\", \"\")","v":""}]
[{"$f":"'Building Information'!A18:B18","v":"Date (yyyy-mm-dd)"},{"$f":"'Building Information'!C18","v":"00:00:00"}]
[{"$f":"'Building Information'!A21:B21","v":"Contact Person"},{"$f":"'Building Information'!C21","v":0}]
["Lighting Contact",{"$f":"'Compliance Paths'!F12","v":" "}]
["Climate Zone",{"$f":"'Building Information'!C38","v":""}]
[null,{"$f":"IF('Building Information'!C28= \"No\", \"Fully Heated Building\", \"Semi-heated Building\")","v":"Fully Heated Building"}]
["Building Permit Number",{"$f":"'Building Information'!I16","v":" (for internal use only)"}]
[]
["#","Question",null,null,"Requirements","Units",null,"Compliant?","Additional Comments"]
{"$rows_left_out":47}
{"sheet":"Part 4 - Details","index":6,"n_rows":8,"n_cols":12,"rows_kept":8,"cut":false,"hidden":true,"merged":[[0,0,0,6],[1,0,1,4]]}
["Part 4 - Details"]
["Please complete the following sheet either for the building or for each space in the building.",null,null,null,null,"Atrium Height (m)",true]
[null,null,"Select compliance option in Cell D3","Space-by-Space Method",{"$f":"OR(COUNTIF(C5:C1048576, \"Atrium < 6 m in height\"), COUNTIF(C5:C1048576, \"Atrium between 6 m and 12 m in height\"), COUNTIF(C5:C1048576, \"Atrium > 12 m in height\"))","v":false}]
["Space #",{"$f":"IF('Part 4 - Details'!$D$3='Validation Reference'!$I$7,\"\",\"Space Description\")","v":"Space Description"},{"$f":"IF('Part 4 - Details'!$D$3='Validation Reference'!$I$7,\"Building Type\",\"Space Type\")","v":"Space Type"},{"$f":"IF('Part 4 - Details'!$D$3='Validation Reference'!$I$7,\"LPD, per Table 4.2.1.5.\",\"LPD, per Table 4.2.1.6\")","v":"LPD, per Table 4.2.1.6"},"Design LPD","LPD Compliant","List Control Type(s) Used, per Table 4.2.1.6.","Atrium Height (m)",null,null,"S-b-S","B-A-M"]
[{"$f":"ROW()-4","v":1},null,null,{"$f":"IF(C5<>\"\",IF(J5=TRUE, (VLOOKUP(C5,'Code Tables'!$I$59:$J$163,2,FALSE)*H5)+VLOOKUP(C5,'Code Tables'!$I$59:$K$163,3,FALSE),VLOOKUP(C5,'Code Tables'!$I$59:$J$163,2,FALSE)),\"\")","v":""},null,{"$f":"IF(AND(C5<>\"-\", E5<>\"\"),IF(D5>=E5,\"Yes\",\"No\"),\"\")","v":""},null,null,null,{"$f":"OR(COUNTIF(C5, \"Atrium < 6 m in height\"), COUNTIF(C5, \"Atrium between 6 m and 12 m in height\"), COUNTIF(C5, \"Atrium > 12 m in height\"))","v":false}]
[2,null,null,{"$f":"IF(C6<>\"\",IF(J6=TRUE, (VLOOKUP(C6,'Code Tables'!$I$59:$J$163,2,FALSE)*H6)+VLOOKUP(C6,'Code Tables'!$I$59:$K$163,3,FALSE),VLOOKUP(C6,'Code Tables'!$I$59:$J$163,2,FALSE)),\"\")","v":""},null,{"$f":"IF(AND(C6<>\"-\", E6<>\"\"),IF(D6>=E6,\"Yes\",\"No\"),\"\")","v":""},null,null,null,false]
[3,null,null,{"$f":"IF(C7<>\"\",IF(J7=TRUE, (VLOOKUP(C7,'Code Tables'!$I$59:$J$163,2,FALSE)*H7)+VLOOKUP(C7,'Code Tables'!$I$59:$K$163,3,FALSE),VLOOKUP(C7,'Code Tables'!$I$59:$J$163,2,FALSE)),\"\")","v":""},null,{"$f":"IF(AND(C7<>\"-\", E7<>\"\"),IF(D7>=E7,\"Yes\",\"No\"),\"\")","v":""},null,null,null,{"$f":"OR(COUNTIF(C7, \"Atrium < 6 m in height\"), COUNTIF(C7, \"Atrium between 6 m and 12 m in height\"), COUNTIF(C7, \"Atrium > 12 m in height\"))","v":false}]
[4,null,null,{"$f":"IF(C8<>\"\",IF(J8=TRUE, (VLOOKUP(C8,'Code Tables'!$I$59:$J$163,2,FALSE)*H8)+VLOOKUP(C8,'Code Tables'!$I$59:$K$163,3,FALSE),VLOOKUP(C8,'Code Tables'!$I$59:$J$163,2,FALSE)),\"\")","v":""},null,{"$f":"IF(AND(C8<>\"-\", E8<>\"\"),IF(D8>=E8,\"Yes\",\"No\"),\"\")","v":""},null,null,null,{"$f":"OR(COUNTIF(C8, \"Atrium < 6 m in height\"), COUNTIF(C8, \"Atrium between 6 m and 12 m in height\"), COUNTIF(C8, \"Atrium > 12 m in height\"))","v":false}]

{"sheet":"Part 4 - Trade-off","index":7,"n_rows":25,"n_cols":9,"rows_kept":25,"cut":false,"hidden":true,"merged":[[1,8,6,8],[0,0,0,8],[2,1,2,5]]}
["Part 4 - Trade-off"]
[{"$f":"'Building Information'!A19:B19","v":"Project Name"},{"$f":"'Building Information'!C19","v":"00:00:00"},null,null,null,null,null,null,{"$f":"IF(SUM(G12:G24) = 33,\"NECB 2015 Compliant\", \"\")","v":""}]
[{"$f":"'Building Information'!A18:B18","v":"Date (yyyy-mm-dd)"},{"$f":"'Building Information'!C18","v":"00:00:00"}]
[{"$f":"'Building Information'!A21:B21","v":"Contact Person"},{"$f":"'Building Information'!C21","v":0}]
["Lighting Contact",{"$f":"'Compliance Paths'!F12","v":" "}]
["Climate Zone",{"$f":"'Building Information'!C38","v":""}]
[null,{"$f":"IF('Building Information'!C28= \"No\", \"Fully Heated Building\", \"Semi-heated Building\")","v":"Fully Heated Building"}]
["Building Permit Number",{"$f":"'Building Information'!I16","v":" (for internal use only)"}]
[]
["#","Question",null,null,"Requirements","Units",null,"Compliant?","Additional Comments"]
{"$rows_left_out":16}
{"sheet":"Part 5 - Prescriptive","index":8,"n_rows":106,"n_cols":9,"rows_kept":106,"cut":false,"hidden":true,"merged":[[1,8,6,8],[0,0,0,8],[2,1,2,5]]}
["Part 5 - Prescriptive"]
[{"$f":"'Building Information'!A19:B19","v":"Project Name"},{"$f":"'Building Information'!C19","v":"00:00:00"},null,null,null,null,null,null,{"$f":"IF(SUM(G12:G20) = 33,\"NECB 2015 Compliant\", \"\")","v":""}]
[{"$f":"'Building Information'!A18:B18","v":"Date (yyyy-mm-dd)"},{"$f":"'Building Information'!C18","v":"00:00:00"}]
[{"$f":"'Building Information'!A21:B21","v":"Contact Person"},{"$f":"'Building Information'!C21","v":0}]
["HVAC Contact",{"$f":"'Compliance Paths'!F17","v":" "}]
["Climate Zone",{"$f":"'Building Information'!C38","v":""}]
[null,{"$f":"IF('Building Information'!C28= \"No\", \"Fully Heated Building\", \"Semi-heated Building\")","v":"Fully Heated Building"}]
["Building Permit Number",{"$f":"'Building Information'!I16","v":" (for internal use only)"}]
[]
["#","Question",null,null,"Requirements","Units",null,"Compliant?","Additional Comments"]
{"$rows_left_out":97}
{"sheet":"Part 5 - Details","index":9,"n_rows":7,"n_cols":7,"rows_kept":7,"cut":false,"hidden":true,"merged":[[0,0,0,6],[1,0,1,6]]}
["Part 5 - Details"]
["Please complete sheet for all HVAC components/equipment in the building. Refer to Tables 5.2.12.1. and 5.2.12.2. for additional information."]
["Equipment #","Equipment Description","Component or Equipment Type","Cooling or Heating Capacity, kW","Standard","Rating Condition","Equipment Performance"]
[{"$f":"ROW(A4)-3","v":1}]
[{"$f":"ROW(A5)-3","v":2}]
[3]
[4]

{"sheet":"Part 5 - Trade-off","index":10,"n_rows":15,"n_cols":9,"rows_kept":15,"cut":false,"hidden":true,"merged":[[1,8,6,8],[0,0,0,8],[2,1,2,5]]}
["Part 5 - Trade-off"]
[{"$f":"'Building Information'!A19:B19","v":"Project Name"},{"$f":"'Building Information'!C19","v":"00:00:00"},null,null,null,null,null,null,{"$f":"IF(SUM(G12:G20) = 33,\"NECB 2015 Compliant\", \"\")","v":""}]
[{"$f":"'Building Information'!A18:B18","v":"Date (yyyy-mm-dd)"},{"$f":"'Building Information'!$C$18","v":"00:00:00"}]
[{"$f":"'Building Information'!A21:B21","v":"Contact Person"},{"$f":"'Building Information'!C21","v":0}]
["HVAC Contact",{"$f":"'Compliance Paths'!F17","v":" "}]
["Climate Zone",{"$f":"'Building Information'!C38","v":""}]
[null,{"$f":"IF('Building Information'!C28= \"No\", \"Fully Heated Building\", \"Semi-heated Building\")","v":"Fully Heated Building"}]
["Building Permit Number",{"$f":"'Building Information'!I16","v":" (for internal use only)"}]
[]
["#","Question",null,null,"Requirements","Units",null,"Compliant?","Additional Comments"]
{"$rows_left_out":6}
{"sheet":"Part 6 - Prescriptive","index":11,"n_rows":42,"n_cols":9,"rows_kept":42,"cut":false,"hidden":true,"merged":[[1,8,6,8],[0,0,0,8],[2,1,2,5]]}
["Part 6 - Prescriptive"]
[{"$f":"'Building Information'!A19:B19","v":"Project Name"},{"$f":"'Building Information'!C19","v":"00:00:00"},null,null,null,null,null,null,{"$f":"IF(SUM(G12:G20) = 33,\"NECB 2015 Compliant\", \"\")","v":""}]
[{"$f":"'Building Information'!A18:B18","v":"Date (yyyy-mm-dd)"},{"$f":"'Building Information'!C18","v":"00:00:00"}]
[{"$f":"'Building Information'!A21:B21","v":"Contact Person"},{"$f":"'Building Information'!C21","v":0}]
["SWH Contact",{"$f":"'Compliance Paths'!F22","v":" "}]
["Climate Zone",{"$f":"'Building Information'!C38","v":""}]
[null,{"$f":"IF('Building Information'!C28= \"No\", \"Fully Heated Building\", \"Semi-heated Building\")","v":"Fully Heated Building"}]
["Building Permit Number",{"$f":"'Building Information'!I16","v":" (for internal use only)"}]
[]
["#","Question",null,null,"Requirements","Units",null,"Compliant?","Additional Comments"]
{"$rows_left_out":33}
{"sheet":"Part 6 - Details","index":12,"n_rows":7,"n_cols":10,"rows_kept":7,"cut":false,"hidden":true,"merged":[[0,0,0,9],[1,0,1,9]]}
["Part 6 - Details"]
["Please complete sheet for all SWH components/equipment in the building. Refer to Table 6.2.2.1. for additional information."]
["Equipment #","Equipment Description","Component Type","Input","Capacity, L","Vt, L","Input/Vt , W/L","Standard","Rating Conditions","Equipment Performance"]
[{"$f":"ROW(A4)-3","v":1}]
[{"$f":"ROW(A5)-3","v":2}]
[3]
[4]

{"sheet":"Part 6 - Trade-off","index":13,"n_rows":15,"n_cols":9,"rows_kept":15,"cut":false,"hidden":true,"merged":[[1,8,6,8],[0,0,0,8],[2,1,2,5]]}
["Part 6 - Trade-off"]
[{"$f":"'Building Information'!A19:B19","v":"Project Name"},{"$f":"'Building Information'!C19","v":"00:00:00"},null,null,null,null,null,null,{"$f":"IF(SUM(G12:G20) = 33,\"NECB 2015 Compliant\", \"\")","v":""}]
[{"$f":"'Building Information'!A18:B18","v":"Date (yyyy-mm-dd)"},{"$f":"'Building Information'!C18","v":"00:00:00"}]
[{"$f":"'Building Information'!A21:B21","v":"Contact Person"},{"$f":"'Building Information'!C21","v":0}]
["SWH Contact",{"$f":"'Compliance Paths'!F22","v":" "}]
["Climate Zone",{"$f":"'Building Information'!C38","v":""}]
[null,{"$f":"IF('Building Information'!C28= \"No\", \"Fully Heated Building\", \"Semi-heated Building\")","v":"Fully Heated Building"}]
["Building Permit Number",{"$f":"'Building Information'!I16","v":" (for internal use only)"}]
[]
["#","Question",null,null,"Requirements","Units",null,"Compliant?","Additional Comments"]
{"$rows_left_out":6}
{"sheet":"Part 7 - Prescriptive","index":14,"n_rows":19,"n_cols":9,"rows_kept":19,"cut":false,"hidden":true,"merged":[[1,8,6,8],[0,0,0,8],[2,1,2,5]]}
["Part 7 - Prescriptive"]
[{"$f":"'Building Information'!A19:B19","v":"Project Name"},{"$f":"'Building Information'!C19","v":"00:00:00"},null,null,null,null,null,null,{"$f":"IF(SUM(G12:G20) = 33,\"NECB 2015 Compliant\", \"\")","v":""}]
[{"$f":"'Building Information'!A18:B18","v":"Date (yyyy-mm-dd)"},{"$f":"'Building Information'!C18","v":"00:00:00"}]
[{"$f":"'Building Information'!A21:B21","v":"Contact Person"},{"$f":"'Building Information'!C21","v":0}]
["Electrical Contact",{"$f":"'Compliance Paths'!F27","v":" "}]
["Climate Zone",{"$f":"'Building Information'!C38","v":""}]
[null,{"$f":"IF('Building Information'!C28= \"No\", \"Fully Heated Building\", \"Semi-heated Building\")","v":"Fully Heated Building"}]
["Building Permit Number",{"$f":"'Building Information'!I16","v":" (for internal use only)"}]
[]
["#","Question",null,null,"Requirements","Units",null,"Compliant?","Additional Comments"]
{"$rows_left_out":10}
{"sheet":"Part 8 - Performance","index":15,"n_rows":95,"n_cols":13,"rows_kept":95,"cut":false,"hidden":true,"merged":[[2,1,2,5],[40,6,40,7],[0,0,0,8],[39,6,39,7],[1,8,6,8],[18,6,18,7],[19,6,19,7],[38,6,38,7],[37,6,37,7],[9,0,9,7],[10,6,10,7],[17,6,17,7],[20,6,20,7],[21,6,21,7],[22,6,22,7],[23,6,23,7],[29,6,29,7],[56,6,56,7],[52,6,52,7],[53,6,53,7],[54,6,54,7],[55,6,55,7],[36,6,36,7],[35,6,35,7],[33,6,33,7],[32,6,32,7],[31,6,31,7],[24,6,24,7],[25,6,25,7],[26,6,26,7],[27,6,27,7],[28,6,28,7],[92,6,92,7],[93,6,93,7],[94,6,94,7],[87,6,87,7],[88,6,88,7],[89,6,89,7],[90,6,90,7],[91,6,91,7]]}
["Part 8 - Performance Compliance"]
[{"$f":"'Building Information'!A19:B19","v":"Project Name"},{"$f":"'Building Information'!C19","v":"00:00:00"},null,null,null,null,null,null,{"$f":"IF(SUM(G12:G20) = 33,\"NECB 2015 Compliant\", \"\")","v":""}]
[{"$f":"'Building Information'!A18:B18","v":"Date (yyyy-mm-dd)"},{"$f":"'Building Information'!C18","v":"00:00:00"}]
[{"$f":"'Building Information'!A21:B21","v":"Contact Person"},{"$f":"'Building Information'!C21","v":0}]
["Energy Modeling Contact",{"$f":"'Compliance Paths'!F32","v":" "}]
["Climate Zone",{"$f":"'Building Information'!C38","v":""}]
[null,{"$f":"IF('Building Information'!C28= \"No\", \"Fully Heated Building\", \"Semi-heated Building\")","v":"Fully Heated Building"}]
["Building Permit Number",{"$f":"'Building Information'!I16","v":" (for internal use only)"}]
[]
["Compliance Requirements:\nPlease complete all fields below and append a building energy modeling report to this checklist. \n",null,null,null,null,null,null,null,"Additional Comments"]
{"$rows_left_out":86}
{"sheet":"Validation Reference","index":16,"n_rows":74,"n_cols":17,"rows_kept":74,"cut":false,"hidden":true,"merged":[]}
[null,null,"Climate Zone",null,null,"City ","Zone"]
["Yes",null,"Zone 4: < 3000 HDD",2,null,null,null,null,"Type of Building",null,null,null,null,null,null,null,"Back-up HVAC and SWH Systems Compliant with Part 8"]
["No",null,"Zone 5: 3000 to 3999 HDD",3,null,null,null,null,"New",null,null,null,"Compliant with Part 8",null,null,null,"Back-up HVAC Systems Compliant with Part 8, Back-up SWH System Compliant with Part 6"]
["N/A",null,"Zone 6: 4000 to 4999 HDD",4,null,null,null,null,"Addition to existing building",null,null,null,"Compliant with Part 4 Prescriptive",null,null,null,"Back-up SWH Systems Compliant with Part 8, Back-up HVAC System Compliant with Part 5"]
[null,null,"Zone 7A: 5000 to 5999 HDD",5,null,null,null,null,null,null,null,null,null,null,null,null,"Back-up HVAC Systems Compliant with Part 8, no Back-up SWH System"]
[null,null,"Zone 7B: 6000 to 6999 HDD",6,null,null,null,null,null,null,null,null,null,null,null,null,"Back-up SWH Systems Compliant with Part 8, no Back-up HVAC System"]
[null,null,"Zone 8: ≥ 7000 HDD",7,null,null,null,null,"Building Area Method",null,null,null,null,null,null,null,"Back-up HVAC Systems Compliant with Part 5, no Back-up SWH System"]
[null,null,null,null,null,null,null,null,"Space-by-Space Method",null,null,null,null,null,null,null,"Back-up SWH Systems Compliant with Part 6, no Back-up HVAC System"]
[null,null,null,null,null,null,null,null,null,null,null,null,null,null,null,null,"Back-up HVAC Systems Compliant with Part 5, Back-up SWH Systems Compliant with Part 6"]
["Help Messages"]
{"$rows_left_out":65}
{"sheet":"Code Tables","index":17,"n_rows":213,"n_cols":32,"rows_kept":213,"cut":false,"hidden":true,"merged":[[197,13,198,13],[197,14,198,14],[197,15,203,15],[200,13,201,13],[200,14,201,14],[202,14,203,14],[189,14,191,14],[189,15,191,15],[192,15,194,15],[193,14,194,14],[182,13,184,13],[182,14,184,14],[182,15,184,15],[182,16,184,16],[187,14,188,14],[164,14,181,14],[164,15,172,15],[173,15,178,15],[179,15,181,15],[150,14,163,14],[128,15,129,15],[130,13,141,13],[130,14,141,14],[130,15,131,15],[132,15,133,15],[134,15,135,15],[136,15,137,15],[138,15,139,15],[140,15,141,15],[143,13,145,13],[143,14,145,14],[146,13,149,13],[146,14,149,14],[146,15,149,15],[126,13,127,13],[126,14,127,14],[128,13,129,13],[128,14,129,14],[121,13,124,13],[121,14,122,14],[121,15,124,15],[123,14,124,14],[110,15,112,15],[113,13,118,13],[113,15,115,15],[116,15,118,15],[119,13,120,13],[119,14,120,14],[119,15,120,15],[99,13,100,13],[99,15,100,15],[99,16,100,16],[101,13,112,13],[101,14,112,14],[101,15,103,15],[104,15,106,15],[107,15,109,15],[65,13,68,13],[89,15,92,15],[93,13,95,13],[94,14,95,14],[96,13,98,13],[97,14,98,14],[69,13,92,13],[69,14,92,14],[69,15,72,15],[73,15,76,15],[77,15,80,15],[81,15,84,15],[85,15,88,15],[51,15,52,15],[53,14,68,14],[53,15,54,15],[55,15,56,15],[57,15,58,15],[59,15,60,15],[61,15,62,15],[63,15,64,15],[65,15,66,15],[67,15,68,15]]}
[null,"Part 3"]
[null,null,null,null,null,null,null,null,null,null,null,null,null,null,null,null,null,"Table 3.2.2.4.",null,null,null,null,null,null,null,"Table 3.2.3.1"]
[null,"Assembly","Zone 4 <3000","Zone 5: 3000 to 3999","Zone 6: 4000 to 4999","Zone 7A: 5000 to 5999","Zone 7B 6000 to 6999","Zone 8 ≥ 7000",null,null,null,null,null,null,null,null,null,"Component","Zone 4 <3000","Zone 5: 3000 to 3999","Zone 6: 4000 to 4999","Zone 7A: 5000 to 5999","Zone 7B 6000 to 6999","Zone 8 ≥ 7000",null,"Assemblies in Contact with the Ground","Zone 4 <3000","Zone 5: 3000 to 3999","Zone 6: 4000 to 4999","Zone 7A: 5000 to 5999","Zone 7B 6000 to 6999","Zone 8 ≥ 7000"]
["Table 3.2.2.2.","Wall",0.315,0.27800000000000002,0.247,0.21,0.21,0.183,null,null,null,null,null,null,null,null,null,"All Doors",2.4,2.2000000000000002,2.2000000000000002,2.2000000000000002,2.2000000000000002,1.6,null,"Walls",0.56799999999999995,0.379,0.28399999999999997,0.28399999999999997,0.28399999999999997,0.21]
[null,"Roof",0.193,0.156,0.156,0.13800000000000001,0.13800000000000001,0.121,null,null,null,null,null,null,null,null,null,null,null,null,null,null,null,null,null,"Roofs",0.56799999999999995,0.379,0.28399999999999997,0.28399999999999997,0.28399999999999997,0.21]
[null,"Floor",0.22700000000000001,0.183,0.183,0.16200000000000001,0.16200000000000001,0.14199999999999999,null,null,null,null,null,null,null,null,null,null,null,null,null,null,null,null,null,"Floors",0.75700000000000001,0.75700000000000001,0.75700000000000001,0.75700000000000001,0.75700000000000001,0.379]
["Table 3.2.2.3.","Fenestration",2.1,1.9,1.9,1.9,1.9,1.4]
["Table 3.2.2.4.","Doors",2.1,1.9,1.9,1.9,1.9,1.4]
["Table 3.2.3.1.","Underground Walls",0.56799999999999995,0.379,0.28399999999999997,0.28399999999999997,0.28399999999999997,0.21]
[null,"Underground Roofs",0.56799999999999995,0.379,0.28399999999999997,0.28399999999999997,0.28399999999999997,0.21]
{"$rows_left_out":203}